Reaction Details
TargetHistone deacetylase 3
LigandBDBM50302073
Substrate/Competitorn/a
Meas. Tech.ChEMBL_599172 (CHEMBL1049815)
IC50 31±n/a nM
Citation Olsen, CAGhadiri, MR Discovery of potent and selective histone deacetylase inhibitors via focused combinatorial libraries of cyclic alpha3beta-tetrapeptides. J Med Chem52:7836-46 (2009) 
 
Histone deacetylase 3
Name:Histone deacetylase 3
Type:Enzyme
Mol. Mass.:48829.55
Organism:Homo sapiens (Human)
Description:O15379
Residue:428
BDBM50302073
NameBDBM50302073
Synonyms:6-((2S,5S,8S,11S)-8-((1H-indol-3-yl)methyl)-2-benzyl-11-isobutyl-3,6,9,13-tetraoxo-1,4,7,10-tetraazacyclotridecan-5-yl)-N-hydroxyhexanamide | CHEMBL566637
TypeSmall organic molecule
Emp. Form.C35H46N6O6
Mol. Mass.646.7763
SMILESCC(C)C[C@H]1CC(=O)N[C@@H](Cc2ccccc2)C(=O)N[C@@H](CCCCCC(=O)NO)C(=O)N[C@@H](Cc2c[nH]c3ccccc23)C(=O)N1