Reaction Details
TargetProstaglandin D2 receptor 2
LigandBDBM50302802
Substrate/Competitorn/a
Meas. Tech.ChEMBL_595293 (CHEMBL1047087)
IC50 3±n/a nM
Citation Liu, JFu, ZWang, YSchmitt, MHuang, AMarshall, DTonn, GSeitz, LSullivan, TLucy Tang, HCollins, TMedina, J Discovery and optimization of CRTH2 and DP dual antagonists. Bioorg Med Chem Lett19:6419-23 (2009) 
 
Prostaglandin D2 receptor 2
Name:Prostaglandin D2 receptor 2
Type:Enzyme
Mol. Mass.:43295.45
Organism:Homo sapiens (Human)
Description:Q9Y5Y4
Residue:395
BDBM50302802
NameBDBM50302802
Synonyms:2-(3-chloro-5-(2-(4-chlorophenylsulfonamido)-4-(ethylcarbamoyl)phenoxy)phenyl)acetic acid | CHEMBL570673
TypeSmall organic molecule
Emp. Form.C23H20Cl2N2O6S
Mol. Mass.523.386
SMILESCCNC(=O)c1ccc(Oc2cc(Cl)cc(CC(O)=O)c2)c(NS(=O)(=O)c2ccc(Cl)cc2)c1