Reaction Details
TargetProstaglandin D2 receptor 2
LigandBDBM50302828
Substrate/Competitorn/a
Meas. Tech.ChEMBL_595293 (CHEMBL1047087)
IC50 3±n/a nM
Citation Liu, JFu, ZWang, YSchmitt, MHuang, AMarshall, DTonn, GSeitz, LSullivan, TLucy Tang, HCollins, TMedina, J Discovery and optimization of CRTH2 and DP dual antagonists. Bioorg Med Chem Lett19:6419-23 (2009) 
 
Prostaglandin D2 receptor 2
Name:Prostaglandin D2 receptor 2
Type:Enzyme
Mol. Mass.:43295.45
Organism:Homo sapiens (Human)
Description:Q9Y5Y4
Residue:395
BDBM50302828
NameBDBM50302828
Synonyms:2-(4-(4-(butylcarbamoyl)-2-(2,4-dichlorophenylsulfonamido)phenoxy)-3-methoxyphenyl)acetic acid | CHEMBL589973
TypeSmall organic molecule
Emp. Form.C26H26Cl2N2O7S
Mol. Mass.581.465
SMILESCCCCNC(=O)c1ccc(Oc2ccc(CC(O)=O)cc2OC)c(NS(=O)(=O)c2ccc(Cl)cc2Cl)c1