Reaction Details
TargetProstaglandin D2 receptor
LigandBDBM50302830
Substrate/Competitorn/a
Meas. Tech.ChEMBL_595294 (CHEMBL1047088)
IC50 36±n/a nM
Citation Liu, JFu, ZWang, YSchmitt, MHuang, AMarshall, DTonn, GSeitz, LSullivan, TLucy Tang, HCollins, TMedina, J Discovery and optimization of CRTH2 and DP dual antagonists. Bioorg Med Chem Lett19:6419-23 (2009) 
 
Prostaglandin D2 receptor
Name:Prostaglandin D2 receptor
Type:Enzyme
Mol. Mass.:40288.87
Organism:Homo sapiens (Human)
Description:Q13258
Residue:359
BDBM50302830
NameBDBM50302830
Synonyms:2-(4-(2-(2,4-dichlorophenylsulfonamido)-4-(isopropylcarbamoyl)phenoxy)-3-methoxyphenyl)acetic acid | CHEMBL569772
TypeSmall organic molecule
Emp. Form.C25H24Cl2N2O7S
Mol. Mass.567.438
SMILESCOc1cc(CC(O)=O)ccc1Oc1ccc(cc1NS(=O)(=O)c1ccc(Cl)cc1Cl)C(=O)NC(C)C