Reaction Details
TargetCarbonic anhydrase 2
LigandBDBM50303034
Substrate/Competitorn/a
Meas. Tech.ChEMBL_597001 (CHEMBL1041845)
Ki 63±n/a nM
Citation Steele, RMBenedini, FBiondi, SBorghi, VCarzaniga, LImpagnatiello, FMiglietta, DChong, WKRajapakse, RCecchi, ATemperini, CSupuran, CT Nitric oxide-donating carbonic anhydrase inhibitors for the treatment of open-angle glaucoma. Bioorg Med Chem Lett19:6565-70 (2009) 
 
Carbonic anhydrase 2
Name:Carbonic anhydrase 2
Type:Enzyme
Mol. Mass.:29250.71
Organism:Homo sapiens (Human)
Description:P00918
Residue:260
BDBM50303034
NameBDBM50303034
Synonyms:CHEMBL571337 | Ethyl-((4S,6S)-6-methyl-7,7-dioxo-2-sulfamoyl-4,5,6,7-tetrahydro-7lambda*6*-thieno[2,3-b]thiopyran-4-yl)-carbamic acid 2,3-bis-nitrooxy-propyl ester
TypeSmall organic molecule
Emp. Form.C14H20N4O12S3
Mol. Mass.532.523
SMILESCCN([C@H]1C[C@H](C)S(=O)(=O)c2sc(cc12)S(N)(=O)=O)C(=O)OCC(CO[N+]([O-])=O)O[N+]([O-])=O