Reaction Details
TargetMitogen-activated protein kinase 8
LigandBDBM50303636
Substrate/Competitorn/a
Meas. Tech.ChEMBL_596582 (CHEMBL1042601)
IC50 535±n/a nM
Citation Kamenecka, TJiang, RSong, XDuckett, DChen, WLing, YYHabel, JLaughlin, JDChambers, JFiguera-Losada, MCameron, MDLin, LRuiz, CHLoGrasso, PV Synthesis, biological evaluation, X-ray structure, and pharmacokinetics of aminopyrimidine c-jun-N-terminal kinase (JNK) inhibitors. J Med Chem53:419-31 (2010) 
 
Mitogen-activated protein kinase 8
Name:Mitogen-activated protein kinase 8
Type:Enzyme
Mol. Mass.:48297.57
Organism:Homo sapiens (Human)
Description:JNK-1 was purchased from Upstate Cell Signaling Solutions (formerly Upstate Biotechnology).
Residue:427
BDBM50303636
NameBDBM50303636
Synonyms:4-(4-Phenylpyrimidin-2-ylamino)benzamide | CHEMBL571619
TypeSmall organic molecule
Emp. Form.C17H14N4O
Mol. Mass.290.3193
SMILESNC(=O)c1ccc(Nc2nccc(n2)-c2ccccc2)cc1