Reaction Details
TargetGlucocorticoid receptor
LigandBDBM19201
Substrate/Competitorn/a
Meas. Tech.ChEMBL_594763 (CHEMBL1039873)
Ki 2.5±n/a nM
Citation Xiao, HYWu, DRMalley, MFGougoutas, JZHabte, SFCunningham, MDSomerville, JEDodd, JHBarrish, JCNadler, SGDhar, TG Novel synthesis of the hexahydroimidazo[1,5b]isoquinoline scaffold: application to the synthesis of glucocorticoid receptor modulators. J Med Chem53:1270-80 (2010) 
 
Glucocorticoid receptor
Name:Glucocorticoid receptor
Type:Enzyme
Mol. Mass.:85656.87
Organism:Homo sapiens (Human)
Description:P04150
Residue:777
BDBM19201
NameBDBM19201
Synonyms:(1S)-1-[(4aR,5S)-1-(4-fluorophenyl)-4a-methyl-1H,4H,4aH,5H,6H,7H,8H-cyclohexa[f]indazol-5-yl]-1-(4-fluorophenyl)ethan-1-ol | N-Arylpyrazolo[3,2-c]-Based Ligand, 21
TypeSmall organic molecule
Emp. Form.C26H26F2N2O
Mol. Mass.420.4942
SMILES[H][C@@]1(CCCC2=Cc3c(C[C@]12C)cnn3-c1ccc(F)cc1)[C@](C)(O)c1ccc(F)cc1