Reaction Details
TargetGlucocorticoid receptor
LigandBDBM50303828
Substrate/Competitorn/a
Meas. Tech.ChEMBL_594764 (CHEMBL1039874)
EC50 25±n/a nM
Citation Xiao, HYWu, DRMalley, MFGougoutas, JZHabte, SFCunningham, MDSomerville, JEDodd, JHBarrish, JCNadler, SGDhar, TG Novel synthesis of the hexahydroimidazo[1,5b]isoquinoline scaffold: application to the synthesis of glucocorticoid receptor modulators. J Med Chem53:1270-80 (2010) 
 
Glucocorticoid receptor
Name:Glucocorticoid receptor
Type:Enzyme
Mol. Mass.:85656.87
Organism:Homo sapiens (Human)
Description:P04150
Residue:777
BDBM50303828
NameBDBM50303828
Synonyms:(S)-1-((5aR,6S)-1-(4-Fluorophenyl)-5a-methyl-5,5a,6,7,8,9-hexahydroimidazo[1,5-b]isoquinolin-6-yl)-1-o-tolylethanol | CHEMBL576472
TypeSmall organic molecule
Emp. Form.C27H29FN2O
Mol. Mass.416.5304
SMILESCc1ccccc1[C@@](C)(O)[C@H]1CCCC2=Cc3c(ncn3C[C@]12C)-c1ccc(F)cc1