Reaction Details
TargetProgesterone receptor
LigandBDBM50303810
Substrate/Competitorn/a
Meas. Tech.ChEMBL_594773 (CHEMBL1040734)
Ki 132±n/a nM
Citation Xiao, HYWu, DRMalley, MFGougoutas, JZHabte, SFCunningham, MDSomerville, JEDodd, JHBarrish, JCNadler, SGDhar, TG Novel synthesis of the hexahydroimidazo[1,5b]isoquinoline scaffold: application to the synthesis of glucocorticoid receptor modulators. J Med Chem53:1270-80 (2010) 
 
Progesterone receptor
Name:Progesterone receptor
Type:Protein
Mol. Mass.:98979.52
Organism:Homo sapiens (Human)
Description:P06401
Residue:933
BDBM50303810
NameBDBM50303810
Synonyms:(S)-1-((5aR,6S)-1-(4-Fluorophenyl)-5a-methyl-5,5a,6,7,8,9-hexahydroimidazo[1,5-b]isoquinolin-6-yl)-1-(3-methylthiophen-2-yl)-ethanol | CHEMBL567028
TypeSmall organic molecule
Emp. Form.C25H27FN2OS
Mol. Mass.422.558
SMILESCc1ccsc1[C@@](C)(O)[C@H]1CCCC2=Cc3c(ncn3C[C@]12C)-c1ccc(F)cc1