Reaction Details
TargetCocaine esterase
LigandBDBM50303940
Substrate/Competitorn/a
Meas. Tech.ChEMBL_595215 (CHEMBL1040871)
IC50 3420±n/a nM
Citation Carolan, CGDillon, GPKhan, DRyder, SAGaynor, JMReidy, SMarquez, JFJones, MHolland, VGilmer, JF Isosorbide-2-benzyl carbamate-5-salicylate, a peripheral anionic site binding subnanomolar selective butyrylcholinesterase inhibitor. J Med Chem53:1190-9 (2010) 
 
Cocaine esterase
Name:Cocaine esterase
Type:PROTEIN
Mol. Mass.:61801.08
Organism:Homo sapiens (Human)
Description:ChEMBL_1494240
Residue:559
BDBM50303940
NameBDBM50303940
Synonyms:2-(Benzylaminocarbonyloxy-)5-O-Salicyloyl-1,4:3,6-dianhydro-D-glucitol | CHEMBL570764
TypeSmall organic molecule
Emp. Form.C21H21NO7
Mol. Mass.399.3939
SMILESOc1ccccc1C(=O)O[C@@H]1CO[C@@H]2[C@H](CO[C@H]12)OC(=O)NCc1ccccc1