Reaction Details
TargetDelta-type opioid receptor
LigandBDBM50304170
Substrate/Competitorn/a
Meas. Tech.ChEMBL_601081 (CHEMBL1071840)
EC50 0.200000±n/a nM
Citation Ghirmai, SAzar, MRCashman, JR Synthesis and pharmacological evaluation of 6-naltrexamine analogs for alcohol cessation. Bioorg Med Chem17:6671-81 (2009) 
 
Delta-type opioid receptor
Name:Delta-type opioid receptor
Type:G Protein-Coupled Receptor (GPCR)
Mol. Mass.:40382.98
Organism:Homo sapiens (Human)
Description:Competition binding assays were carried out using membrane preparations from transfected HN9.10 cells that constitutively expressed the delta opioid receptor.
Residue:372
BDBM50304170
NameBDBM50304170
Synonyms:17-Cyclopropylmethyl-3,14beta-dihydroxy-4,5alpha-epoxy-6beta-[(4'-bromo)benzamido]morphinan-oxalate [14C]-17-Cyclopropylmethyl-3,14beta-dihydroxy-4,5alpha-epoxy-6beta-[(4'-bromo)benzamido]morphinan-oxalate
TypeSmall organic molecule
Emp. Form.C27H29BrN2O4
Mol. Mass.525.434
SMILESOc1ccc2C[C@H]3N(CC4CC4)CC[C@@]45[C@@H](Oc1c24)[C@@H](CC[C@@]35O)NC(=O)c1ccc(Br)cc1