Reaction Details
TargetDelta-type opioid receptor
LigandBDBM50304174
Substrate/Competitorn/a
Meas. Tech.ChEMBL_601081 (CHEMBL1071840)
EC50 42±n/a nM
Citation Ghirmai, SAzar, MRCashman, JR Synthesis and pharmacological evaluation of 6-naltrexamine analogs for alcohol cessation. Bioorg Med Chem17:6671-81 (2009) 
 
Delta-type opioid receptor
Name:Delta-type opioid receptor
Type:G Protein-Coupled Receptor (GPCR)
Mol. Mass.:40382.98
Organism:Homo sapiens (Human)
Description:Competition binding assays were carried out using membrane preparations from transfected HN9.10 cells that constitutively expressed the delta opioid receptor.
Residue:372
BDBM50304174
NameBDBM50304174
Synonyms:4-chloro-N-[(1S,5R,13R,14R,17S)-4-(cyclopropylmethyl)-10,17-dihydroxy-12-oxa-4-azapentacyclo[9.6.1.0^{1,13}.0^{5,17}.0^{7,18}]octadeca-7(18),8,10-trien-14-yl]benzamide; oxalic acid | CHEMBL611933
TypeSmall organic molecule
Emp. Form.C27H29ClN2O4
Mol. Mass.480.983
SMILESOc1ccc2C[C@H]3N(CC4CC4)CC[C@@]45[C@@H](Oc1c24)[C@@H](CC[C@@]35O)NC(=O)c1ccc(Cl)cc1