Reaction Details
TargetMu-type opioid receptor
LigandBDBM50304173
Substrate/Competitorn/a
Meas. Tech.ChEMBL_601074 (CHEMBL1071833)
Ki 0.480000±n/a nM
Citation Ghirmai, SAzar, MRCashman, JR Synthesis and pharmacological evaluation of 6-naltrexamine analogs for alcohol cessation. Bioorg Med Chem17:6671-81 (2009) 
 
Mu-type opioid receptor
Name:Mu-type opioid receptor
Type:G Protein-Coupled Receptor (GPCR)
Mol. Mass.:44789.51
Organism:Homo sapiens (Human)
Description:P35372
Residue:400
BDBM50304173
NameBDBM50304173
Synonyms:3,4-dichloro-N-[(1S,5R,13R,14R,17S)-4-(cyclopropylmethyl)-10,17-dihydroxy-12-oxa-4-azapentacyclo[9.6.1.0^{1,13}.0^{5,17}.0^{7,18}]octadeca-7(18),8,10-trien-14-yl]benzamide; oxalic acid | CHEMBL593215
TypeSmall organic molecule
Emp. Form.C27H28Cl2N2O4
Mol. Mass.515.428
SMILESOc1ccc2C[C@H]3N(CC4CC4)CC[C@@]45[C@@H](Oc1c24)[C@@H](CC[C@@]35O)NC(=O)c1ccc(Cl)c(Cl)c1