Reaction Details
TargetKappa-type opioid receptor
LigandBDBM50045776
Substrate/Competitorn/a
Meas. Tech.ChEMBL_601076 (CHEMBL1071835)
Ki 1±n/a nM
Citation Ghirmai, SAzar, MRCashman, JR Synthesis and pharmacological evaluation of 6-naltrexamine analogs for alcohol cessation. Bioorg Med Chem17:6671-81 (2009) 
 
Kappa-type opioid receptor
Name:Kappa-type opioid receptor
Type:G Protein-Coupled Receptor (GPCR)
Mol. Mass.:42648.76
Organism:Homo sapiens (Human)
Description:P41145
Residue:380
BDBM50045776
NameBDBM50045776
Synonyms:CHEMBL982 NALMEFENE ORF-11676 cid_5284594
TypeSmall organic molecule
Emp. Form.C21H25NO3
Mol. Mass.339.4281
SMILESOc1ccc2C[C@H]3N(CC4CC4)CC[C@@]45[C@@H](Oc1c24)C(=C)CC[C@@]35O