Reaction Details
TargetKappa-type opioid receptor
LigandBDBM50304175
Substrate/Competitorn/a
Meas. Tech.ChEMBL_601089 (CHEMBL1072486)
Ki 0.015±n/a nM
Citation Ghirmai, SAzar, MRCashman, JR Synthesis and pharmacological evaluation of 6-naltrexamine analogs for alcohol cessation. Bioorg Med Chem17:6671-81 (2009) 
 
Kappa-type opioid receptor
Name:Kappa-type opioid receptor
Type:G Protein-Coupled Receptor (GPCR)
Mol. Mass.:42648.76
Organism:Homo sapiens (Human)
Description:P41145
Residue:380
BDBM50304175
NameBDBM50304175
Synonyms:17-Cyclopropylmethyl-3,14beta-dihydroxy-4,5alpha-epoxy-6beta-[(4'-methyl)benzamido]morphinan-oxalate | CHEMBL593214
TypeSmall organic molecule
Emp. Form.C28H32N2O4
Mol. Mass.460.5647
SMILESCc1ccc(cc1)C(=O)N[C@@H]1CC[C@@]2(O)[C@H]3Cc4ccc(O)c5O[C@@H]1[C@]2(CCN3CC1CC1)c45