Reaction Details
TargetUrotensin-2 receptor
LigandBDBM50378580
Substrate/Competitorn/a
Meas. Tech.ChEMBL_605403 (CHEMBL1073397)
EC50 1.09±n/a nM
Citation Odagami, TTsuda, YKogami, YKouji, HOkada, Y Identification of new agonists of urotensin-II from a cyclic peptide library. Bioorg Med Chem17:6742-7 (2009) 
 
Urotensin-2 receptor
Name:Urotensin-2 receptor
Type:Enzyme Catalytic Domain
Mol. Mass.:42159.71
Organism:Homo sapiens (Human)
Description:Urotensin-II UTS2R HUMAN::Q9UKP6
Residue:389
BDBM50378580
NameBDBM50378580
Synonyms:CHEMBL437430
TypeSmall organic molecule
Emp. Form.C64H85N13O18S2
Mol. Mass.1388.566
SMILESCC(C)[C@H](NC(=O)[C@@H]1CSSC[C@@H](NC(=O)[C@H](CC(O)=O)NC(=O)[C@H]2CCCN2C(=O)[C@@H](NC(=O)[C@@H](N)CCC(O)=O)[C@@H](C)O)C(=O)N[C@H](Cc2ccccc2)C(=O)N[C@@H](Cc2c[nH]c3ccccc23)C(=O)N[C@H](CCCCN)C(=O)N[C@@H](Cc2ccc(O)cc2)C(=O)N1)C(O)=O