Reaction Details
TargetAsialoglycoprotein receptor 1
LigandBDBM50304486
Substrate/Competitorn/a
Meas. Tech.ChEMBL_603826 (CHEMBL1042966)
Kd 150000±n/a nM
Citation Stokmaier, DKhorev, OCutting, BBorn, RRicklin, DErnst, TOBöni, FSchwingruber, KGentner, MWittwer, MSpreafico, MVedani, ARabbani, SSchwardt, OErnst, B Design, synthesis and evaluation of monovalent ligands for the asialoglycoprotein receptor (ASGP-R). Bioorg Med Chem17:7254-64 (2009) 
 
Asialoglycoprotein receptor 1
Name:Asialoglycoprotein receptor 1
Type:PROTEIN
Mol. Mass.:33177.60
Organism:Homo sapiens (Human)
Description:ChEMBL_603824
Residue:291
BDBM50304486
NameBDBM50304486
Synonyms:(3R,4R,5R,6R)-3-acetamido-6-(acetoxymethyl)tetrahydro-2H-pyran-2,4,5-triyl triacetate | CHEMBL610736
TypeSmall organic molecule
Emp. Form.C16H23NO10
Mol. Mass.389.3545
SMILESCC(=O)N[C@H]1C(OC(C)=O)O[C@H](COC(C)=O)[C@H](OC(C)=O)[C@@H]1OC(C)=O