Reaction Details
TargetStromelysin-1
LigandBDBM8465
Substrate/Competitorn/a
Meas. Tech.ChEMBL_603252 (CHEMBL1049476)
Kd 7±n/a nM
Citation Wilfong, EMLocklear, UToone, EJ A single step purification for autolytic zinc proteinases. Bioorg Med Chem Lett20:280-2 (2010) 
 
Stromelysin-1
Name:Stromelysin-1
Type:Enzyme
Mol. Mass.:53973.13
Organism:Homo sapiens (Human)
Description: P08254
Residue:477
BDBM8465
NameBDBM8465
Synonyms:(2R)-N-hydroxy-2-[(4-methoxybenzene)(pyridin-3-ylmethyl)sulfonamido]-3-methylbutanamide CGS 27023 CHEMBL514138 | hydroxamate analogue 1
TypeSmall organic molecule
Emp. Form.C18H23N3O5S
Mol. Mass.393.457
SMILESCOc1ccc(cc1)S(=O)(=O)N(Cc1cccnc1)[C@H](C(C)C)C(=O)NO