Reaction Details
TargetAromatase
LigandBDBM10015
Substrate/Competitorn/a
Meas. Tech.ChEMBL_612867 (CHEMBL1067556)
IC50 1.5±n/a nM
Citation Woo, LWJackson, TPutey, ACozier, GLeonard, PAcharya, KRChander, SKPurohit, AReed, MJPotter, BV Highly potent first examples of dual aromatase-steroid sulfatase inhibitors based on a biphenyl template. J Med Chem53:2155-70 (2010) 
 
Aromatase
Name:Aromatase
Type:Enzyme
Mol. Mass.:57888.92
Organism:Homo sapiens (Human)
Description:P11511
Residue:503
BDBM10015
NameBDBM10015
Synonyms:2-[3-(1-cyano-1-methylethyl)-5-(1H-1,2,4-triazol-1-ylmethyl)phenyl]-2-methylpropanenitrile ANASTROZOLE NSC719344 | arimidex
TypeSmall organic molecule
Emp. Form.C17H19N5
Mol. Mass.293.3663
SMILESCC(C)(C#N)c1cc(Cn2cncn2)cc(c1)C(C)(C)C#N