Reaction Details
TargetProstaglandin G/H synthase 1
LigandBDBM50074922
Substrate/Competitorn/a
Meas. Tech.ChEMBL_613375 (CHEMBL1067573)
IC50 500±n/a nM
Citation Ehrman, TMBarlow, DJHylands, PJ In silico search for multi-target anti-inflammatories in Chinese herbs and formulas. Bioorg Med Chem18:2204-18 (2010) 
 
Prostaglandin G/H synthase 1
Name:Prostaglandin G/H synthase 1
Type:Protein
Mol. Mass.:68868.60
Organism:Ovis aries (Sheep)
Description:n/a
Residue:600
BDBM50074922
NameBDBM50074922
Synonyms:(+-)-2-fluoro-alpha-methyl-4-biphenylacetic acid 2-(2-fluorobiphenyl-4-yl)propanoic acid 3-fluoro-4-phenylhydratropic acid CHEMBL563 US9630914, Compound A
TypeSmall organic molecule
Emp. Form.C15H13FO2
Mol. Mass.244.2609
SMILESCC(C(O)=O)c1ccc(c(F)c1)-c1ccccc1