Reaction Details
TargetRho-associated protein kinase 2
LigandBDBM50308866
Substrate/Competitorn/a
Meas. Tech.ChEMBL_607703 (CHEMBL1066168)
IC50 230±n/a nM
Citation Morwick, TBüttner, FHCywin, CLDahmann, GHickey, EJakes, SKaplita, PKashem, MAKerr, SKugler, SMao, WMarshall, DPaw, ZShih, CKWu, FYoung, E Hit to lead account of the discovery of bisbenzamide and related ureidobenzamide inhibitors of Rho kinase. J Med Chem53:759-77 (2010) 
 
Rho-associated protein kinase 2
Name:Rho-associated protein kinase 2
Type:Protein
Mol. Mass.:160885.43
Organism:Homo sapiens (Human)
Description:O75116
Residue:1388
BDBM50308866
NameBDBM50308866
Synonyms:3-Chloro-N-[3-(4-dimethylaminomethyl-phenylcarbamoyl)-benzyl]-4-methoxy-benzamide | CHEMBL592709
TypeSmall organic molecule
Emp. Form.C25H26ClN3O3
Mol. Mass.451.945
SMILESCOc1ccc(cc1Cl)C(=O)NCc1cccc(c1)C(=O)Nc1ccc(CN(C)C)cc1