Reaction Details
TargetRho-associated protein kinase 2
LigandBDBM50308880
Substrate/Competitorn/a
Meas. Tech.ChEMBL_607703 (CHEMBL1066168)
IC50 5500±n/a nM
Citation Morwick, TBüttner, FHCywin, CLDahmann, GHickey, EJakes, SKaplita, PKashem, MAKerr, SKugler, SMao, WMarshall, DPaw, ZShih, CKWu, FYoung, E Hit to lead account of the discovery of bisbenzamide and related ureidobenzamide inhibitors of Rho kinase. J Med Chem53:759-77 (2010) 
 
Rho-associated protein kinase 2
Name:Rho-associated protein kinase 2
Type:Protein
Mol. Mass.:160885.43
Organism:Homo sapiens (Human)
Description:O75116
Residue:1388
BDBM50308880
NameBDBM50308880
Synonyms:3-((3-(3-cyanophenyl)ureido)methyl)-N-(2-(pyridin-4-yl)ethyl)benzamide | CHEMBL597523
TypeSmall organic molecule
Emp. Form.C23H21N5O2
Mol. Mass.399.4451
SMILESO=C(NCc1cccc(c1)C(=O)NCCc1ccncc1)Nc1cccc(c1)C#N