Reaction Details
TargetRho-associated protein kinase 2
LigandBDBM50308887
Substrate/Competitorn/a
Meas. Tech.ChEMBL_607703 (CHEMBL1066168)
IC50>7000000±n/a nM
Citation Morwick, TBüttner, FHCywin, CLDahmann, GHickey, EJakes, SKaplita, PKashem, MAKerr, SKugler, SMao, WMarshall, DPaw, ZShih, CKWu, FYoung, E Hit to lead account of the discovery of bisbenzamide and related ureidobenzamide inhibitors of Rho kinase. J Med Chem53:759-77 (2010) 
 
Rho-associated protein kinase 2
Name:Rho-associated protein kinase 2
Type:Protein
Mol. Mass.:160885.43
Organism:Homo sapiens (Human)
Description:O75116
Residue:1388
BDBM50308887
NameBDBM50308887
Synonyms:1,3-Benzodioxole-5-carboxylic acid 3-(2-pyridin-4-yl-ethylcarbamoyl)-benzylamide | CHEMBL597534
TypeSmall organic molecule
Emp. Form.C23H21N3O4
Mol. Mass.403.4305
SMILESO=C(NCCc1ccncc1)c1cccc(CNC(=O)c2ccc3OCOc3c2)c1