Reaction Details
TargetRho-associated protein kinase 2
LigandBDBM50308888
Substrate/Competitorn/a
Meas. Tech.ChEMBL_607703 (CHEMBL1066168)
IC50>7000000±n/a nM
Citation Morwick, TBüttner, FHCywin, CLDahmann, GHickey, EJakes, SKaplita, PKashem, MAKerr, SKugler, SMao, WMarshall, DPaw, ZShih, CKWu, FYoung, E Hit to lead account of the discovery of bisbenzamide and related ureidobenzamide inhibitors of Rho kinase. J Med Chem53:759-77 (2010) 
 
Rho-associated protein kinase 2
Name:Rho-associated protein kinase 2
Type:Protein
Mol. Mass.:160885.43
Organism:Homo sapiens (Human)
Description:O75116
Residue:1388
BDBM50308888
NameBDBM50308888
Synonyms:3-Methoxy-N-[3-(2-pyridin-4-yl-ethylcarbamoyl)-benzyl]-benzamide | CHEMBL591914
TypeSmall organic molecule
Emp. Form.C23H23N3O3
Mol. Mass.389.447
SMILESCOc1cccc(c1)C(=O)NCc1cccc(c1)C(=O)NCCc1ccncc1