Reaction Details
TargetRho-associated protein kinase 2
LigandBDBM50308898
Substrate/Competitorn/a
Meas. Tech.ChEMBL_607703 (CHEMBL1066168)
IC50 4±n/a nM
Citation Morwick, TBüttner, FHCywin, CLDahmann, GHickey, EJakes, SKaplita, PKashem, MAKerr, SKugler, SMao, WMarshall, DPaw, ZShih, CKWu, FYoung, E Hit to lead account of the discovery of bisbenzamide and related ureidobenzamide inhibitors of Rho kinase. J Med Chem53:759-77 (2010) 
 
Rho-associated protein kinase 2
Name:Rho-associated protein kinase 2
Type:Protein
Mol. Mass.:160885.43
Organism:Homo sapiens (Human)
Description:O75116
Residue:1388
BDBM50308898
NameBDBM50308898
Synonyms:3-[3-(4-Amido-phenyl)-ureidomethyl]-N-(1,2,3,4-tetrahydroisoquinolin-7-yl)-benzamide | CHEMBL600852
TypeSmall organic molecule
Emp. Form.C25H25N5O3
Mol. Mass.443.4977
SMILESNC(=O)c1ccc(NC(=O)NCc2cccc(c2)C(=O)Nc2ccc3CCNCc3c2)cc1