Reaction Details
TargetRho-associated protein kinase 2
LigandBDBM50308900
Substrate/Competitorn/a
Meas. Tech.ChEMBL_607703 (CHEMBL1066168)
IC50 73±n/a nM
Citation Morwick, TBüttner, FHCywin, CLDahmann, GHickey, EJakes, SKaplita, PKashem, MAKerr, SKugler, SMao, WMarshall, DPaw, ZShih, CKWu, FYoung, E Hit to lead account of the discovery of bisbenzamide and related ureidobenzamide inhibitors of Rho kinase. J Med Chem53:759-77 (2010) 
 
Rho-associated protein kinase 2
Name:Rho-associated protein kinase 2
Type:Protein
Mol. Mass.:160885.43
Organism:Homo sapiens (Human)
Description:O75116
Residue:1388
BDBM50308900
NameBDBM50308900
Synonyms:3,4-Dimethoxy-N-[3-(3-piperidin-3-yl-propionylamino)-benzyl]-benzamide | CHEMBL590322
TypeSmall organic molecule
Emp. Form.C24H31N3O4
Mol. Mass.425.5206
SMILESCOc1ccc(cc1OC)C(=O)NCc1cccc(NC(=O)CCC2CCCNC2)c1