Reaction Details
TargetProtein kinase C epsilon type
LigandBDBM50308861
Substrate/Competitorn/a
Meas. Tech.ChEMBL_607695 (CHEMBL1066160)
IC50>5000±n/a nM
Citation Morwick, TBüttner, FHCywin, CLDahmann, GHickey, EJakes, SKaplita, PKashem, MAKerr, SKugler, SMao, WMarshall, DPaw, ZShih, CKWu, FYoung, E Hit to lead account of the discovery of bisbenzamide and related ureidobenzamide inhibitors of Rho kinase. J Med Chem53:759-77 (2010) 
 
Protein kinase C epsilon type
Name:Protein kinase C epsilon type
Type:Enzyme
Mol. Mass.:83680.45
Organism:Homo sapiens (Human)
Description:The recombinant human PKC enzymes were produced using a baculovirus expression system in SF9 cells
Residue:737
BDBM50308861
NameBDBM50308861
Synonyms:3-[3-(4-Cyano-phenyl)-ureidomethyl]-N-(4-dimethylaminomethylphenyl)-benzamide | CHEMBL590811
TypeSmall organic molecule
Emp. Form.C25H25N5O2
Mol. Mass.427.4983
SMILESCN(C)Cc1ccc(NC(=O)c2cccc(CNC(=O)Nc3ccc(cc3)C#N)c2)cc1