Reaction Details
TargetProtein kinase C epsilon type
LigandBDBM50308876
Substrate/Competitorn/a
Meas. Tech.ChEMBL_607695 (CHEMBL1066160)
IC50>5000±n/a nM
Citation Morwick, TBüttner, FHCywin, CLDahmann, GHickey, EJakes, SKaplita, PKashem, MAKerr, SKugler, SMao, WMarshall, DPaw, ZShih, CKWu, FYoung, E Hit to lead account of the discovery of bisbenzamide and related ureidobenzamide inhibitors of Rho kinase. J Med Chem53:759-77 (2010) 
 
Protein kinase C epsilon type
Name:Protein kinase C epsilon type
Type:Enzyme
Mol. Mass.:83680.45
Organism:Homo sapiens (Human)
Description:The recombinant human PKC enzymes were produced using a baculovirus expression system in SF9 cells
Residue:737
BDBM50308876
NameBDBM50308876
Synonyms:3,4-Dimethoxy-N-[3-(1,2,3,4-tetrahydro-isoquinolin-7-ylcarbamoyl)-benzyl]-benzamide | CHEMBL604087
TypeSmall organic molecule
Emp. Form.C26H27N3O4
Mol. Mass.445.5103
SMILESCOc1ccc(cc1OC)C(=O)NCc1cccc(c1)C(=O)Nc1ccc2CCNCc2c1