Reaction Details
TargetSerine/threonine-protein kinase N2
LigandBDBM50308872
Substrate/Competitorn/a
Meas. Tech.ChEMBL_607697 (CHEMBL1066162)
IC50 4400±n/a nM
Citation Morwick, TBüttner, FHCywin, CLDahmann, GHickey, EJakes, SKaplita, PKashem, MAKerr, SKugler, SMao, WMarshall, DPaw, ZShih, CKWu, FYoung, E Hit to lead account of the discovery of bisbenzamide and related ureidobenzamide inhibitors of Rho kinase. J Med Chem53:759-77 (2010) 
 
Serine/threonine-protein kinase N2
Name:Serine/threonine-protein kinase N2
Type:PROTEIN
Mol. Mass.:112029.78
Organism:Homo sapiens (Human)
Description:ChEMBL_1433151
Residue:984
BDBM50308872
NameBDBM50308872
Synonyms:3,4-Dimethoxy-N-[3-(2-piperidin-3-yl-ethylcarbamoyl)-benzyl]-benzamide | CHEMBL597127
TypeSmall organic molecule
Emp. Form.C24H31N3O4
Mol. Mass.425.5206
SMILESCOc1ccc(cc1OC)C(=O)NCc1cccc(c1)C(=O)NCCC1CCCNC1