Reaction Details
TargetCell division control protein 42 homolog
LigandBDBM50308897
Substrate/Competitorn/a
Meas. Tech.ChEMBL_607696 (CHEMBL1066161)
IC50>5000±n/a nM
Citation Morwick, TBüttner, FHCywin, CLDahmann, GHickey, EJakes, SKaplita, PKashem, MAKerr, SKugler, SMao, WMarshall, DPaw, ZShih, CKWu, FYoung, E Hit to lead account of the discovery of bisbenzamide and related ureidobenzamide inhibitors of Rho kinase. J Med Chem53:759-77 (2010) 
 
Cell division control protein 42 homolog
Name:Cell division control protein 42 homolog
Type:PROTEIN
Mol. Mass.:21258.36
Organism:Homo sapiens (Human)
Description:ChEMBL_652970
Residue:191
BDBM50308897
NameBDBM50308897
Synonyms:3-[3-(4-Cyano-phenyl)-ureidomethyl]-N-(2-piperidin-3-yl-ethyl)-benzamide | CHEMBL589359
TypeSmall organic molecule
Emp. Form.C23H27N5O2
Mol. Mass.405.4928
SMILESO=C(NCc1cccc(c1)C(=O)NCCC1CCCNC1)Nc1ccc(cc1)C#N