Reaction Details
TargetCytochrome P450 2C9
LigandBDBM50308867
Substrate/Competitorn/a
Meas. Tech.ChEMBL_611718 (CHEMBL1074312)
IC50>30000±n/a nM
Citation Morwick, TBüttner, FHCywin, CLDahmann, GHickey, EJakes, SKaplita, PKashem, MAKerr, SKugler, SMao, WMarshall, DPaw, ZShih, CKWu, FYoung, E Hit to lead account of the discovery of bisbenzamide and related ureidobenzamide inhibitors of Rho kinase. J Med Chem53:759-77 (2010) 
 
Cytochrome P450 2C9
Name:Cytochrome P450 2C9
Type:Enzyme
Mol. Mass.:55636.33
Organism:Homo sapiens (Human)
Description:P11712
Residue:490
BDBM50308867
NameBDBM50308867
Synonyms:CHEMBL604249 | N-[3-(4-Dimethylaminomethyl-phenylcarbamoyl)-benzyl]-4-methoxy-3-methyl-benzamide
TypeSmall organic molecule
Emp. Form.C26H29N3O3
Mol. Mass.431.5268
SMILESCOc1ccc(cc1C)C(=O)NCc1cccc(c1)C(=O)Nc1ccc(CN(C)C)cc1