Reaction Details
TargetCytochrome P450 2D6
LigandBDBM50308899
Substrate/Competitorn/a
Meas. Tech.ChEMBL_611720 (CHEMBL1074314)
IC50>30000±n/a nM
Citation Morwick, TBüttner, FHCywin, CLDahmann, GHickey, EJakes, SKaplita, PKashem, MAKerr, SKugler, SMao, WMarshall, DPaw, ZShih, CKWu, FYoung, E Hit to lead account of the discovery of bisbenzamide and related ureidobenzamide inhibitors of Rho kinase. J Med Chem53:759-77 (2010) 
 
Cytochrome P450 2D6
Name:Cytochrome P450 2D6
Type:Protein
Mol. Mass.:55774.82
Organism:Homo sapiens (Human)
Description:P10635
Residue:497
BDBM50308899
NameBDBM50308899
Synonyms:CHEMBL605360 | N-[3-(4-Hydroxymethyl-phenylcarbamoyl)-benzyl]-3,4-dimethoxybenzamide
TypeSmall organic molecule
Emp. Form.C24H24N2O5
Mol. Mass.420.4578
SMILESCOc1ccc(cc1OC)C(=O)NCc1cccc(c1)C(=O)Nc1ccc(CO)cc1