Reaction Details
TargetSodium-dependent serotonin transporter
LigandBDBM50309686
Substrate/Competitorn/a
Meas. Tech.ChEMBL_610803 (CHEMBL1068120)
Ki 1060±n/a nM
Citation Hojahmat, MHorton, DBNorrholm, SDMiller, DKGrinevich, VPDeaciuc, AGDwoskin, LPCrooks, PA Lobeline esters as novel ligands for neuronal nicotinic acetylcholine receptors and neurotransmitter transporters. Bioorg Med Chem18:640-9 (2010) 
 
Sodium-dependent serotonin transporter
Name:Sodium-dependent serotonin transporter
Type:Multi-pass membrane protein
Mol. Mass.:70168.43
Organism:Rattus norvegicus (rat)
Description:P31652
Residue:630
BDBM50309686
NameBDBM50309686
Synonyms:(2S,6S,2R)-2-[6-(2-Isobutyryloxy-2-phenylethyl)-1-methylpiperidin-2-yl]-1-phenylethanone hydrochloride | CHEMBL596682
TypeSmall organic molecule
Emp. Form.C26H33NO3
Mol. Mass.407.5451
SMILESCC(C)C(=O)O[C@@H](C[C@@H]1CCC[C@H](CC(=O)c2ccccc2)N1C)c1ccccc1