Reaction Details
Target5-hydroxytryptamine receptor 1A
LigandBDBM50309808
Substrate/Competitorn/a
Meas. Tech.ChEMBL_611183 (CHEMBL1065705)
Ki 3.1±n/a nM
Citation Liu, ZZhang, HYe, NZhang, JWu, QSun, PLi, LZhen, XZhang, A Synthesis of dihydrofuroaporphine derivatives: identification of a potent and selective serotonin 5-HT 1A receptor agonist. J Med Chem53:1319-28 (2010) 
 
5-hydroxytryptamine receptor 1A
Name:5-hydroxytryptamine receptor 1A
Type:n/a
Mol. Mass.:46122.49
Organism:Homo sapiens (Human)
Description:n/a
Residue:422
BDBM50309808
NameBDBM50309808
Synonyms:CHEMBL597094 | Cis-N-Methyl-2'-methyl-2',3'-dihydrofuro[m]aporphine
TypeSmall organic molecule
Emp. Form.C20H21NO
Mol. Mass.291.3868
SMILESC[C@@H]1Cc2ccc3C[C@H]4N(C)CCc5cccc(c45)-c3c2O1