Reaction Details
Target5-hydroxytryptamine receptor 1A
LigandBDBM10755
Substrate/Competitorn/a
Meas. Tech.ChEMBL_611187 (CHEMBL1065709)
EC50 147±n/a nM
Citation Liu, ZZhang, HYe, NZhang, JWu, QSun, PLi, LZhen, XZhang, A Synthesis of dihydrofuroaporphine derivatives: identification of a potent and selective serotonin 5-HT 1A receptor agonist. J Med Chem53:1319-28 (2010) 
 
5-hydroxytryptamine receptor 1A
Name:5-hydroxytryptamine receptor 1A
Type:n/a
Mol. Mass.:46122.49
Organism:Homo sapiens (Human)
Description:n/a
Residue:422
BDBM10755
NameBDBM10755
Synonyms:14C-5-hydroxy tryptamine creatinine disulfate 5-HT 5-hydroxy tryptamine creatinine disulfate Serotonin | [3H]-5-HT
TypeSmall organic molecule
Emp. Form.C10H12N2O
Mol. Mass.176.2151
SMILESNCCc1c[nH]c2ccc(O)cc12