Reaction Details
TargetBifunctional dihydrofolate reductase-thymidylate synthase
LigandBDBM18245
Substrate/Competitorn/a
Meas. Tech.ChEMBL_608255 (CHEMBL1073058)
pH7.4±n/a
IC50 170±n/a nM
Commentsextracted
Citation Gangjee, AJain, HDPhan, JGuo, XQueener, SFKisliuk, RL 2,4-Diamino-5-methyl-6-substituted arylthio-furo[2,3-d]pyrimidines as novel classical and nonclassical antifolates as potential dual thymidylate synthase and dihydrofolate reductase inhibitors. Bioorg Med Chem18:953-61 (2010) 
 
Bifunctional dihydrofolate reductase-thymidylate synthase
Name:Bifunctional dihydrofolate reductase-thymidylate synthase
Type:Enzyme
Mol. Mass.:68757.49
Organism:Toxoplasma gondii
Description:Q07422
Residue:610
BDBM18245
NameBDBM18245
Synonyms:(2S)-2-{[4-({2,4-diamino-5-methyl-7H-pyrrolo[2,3-d]pyrimidin-6-yl}sulfanyl)phenyl]formamido}pentanedioic acid Pyrrolo[2, 3-d]pyrimidine analogue, 1a
TypeSmall organic molecule
Emp. Form.C19H20N6O5S
Mol. Mass.444.464
SMILESCc1c(Sc2ccc(cc2)C(=O)N[C@@H](CCC(O)=O)C(O)=O)[nH]c2nc(N)nc(N)c12