Reaction Details
Target17-beta-hydroxysteroid dehydrogenase type 1
LigandBDBM50311666
Substrate/Competitorn/a
Meas. Tech.ChEMBL_618686 (CHEMBL1102464)
IC50 56±n/a nM
Citation Möller, GDeluca, DGege, CRosinus, AKowalik, DPeters, ODroescher, PElger, WAdamski, JHillisch, A Structure-based design, synthesis and in vitro characterization of potent 17beta-hydroxysteroid dehydrogenase type 1 inhibitors based on 2-substitutions of estrone and D-homo-estrone. Bioorg Med Chem Lett19:6740-4 (2009) 
 
17-beta-hydroxysteroid dehydrogenase type 1
Name:17-beta-hydroxysteroid dehydrogenase type 1
Type:Enzyme
Mol. Mass.:34945.13
Organism:Homo sapiens (Human)
Description:P14061
Residue:328
BDBM50311666
NameBDBM50311666
Synonyms:(8R,9S,13S,14S)-3-hydroxy-13-methyl-2-(phenylethynyl)-7,8,9,11,12,13,15,16-octahydro-6H-cyclopenta[a]phenanthren-17(14H)-one | CHEMBL1080305
TypeSmall organic molecule
Emp. Form.C26H26O2
Mol. Mass.370.4834
SMILESC[C@]12CC[C@H]3[C@@H](CCc4cc(O)c(cc34)C#Cc3ccccc3)[C@@H]1CCC2=O