Reaction Details
Target17-beta-hydroxysteroid dehydrogenase type 1
LigandBDBM50311678
Substrate/Competitorn/a
Meas. Tech.ChEMBL_618686 (CHEMBL1102464)
IC50 32±n/a nM
Citation Möller, GDeluca, DGege, CRosinus, AKowalik, DPeters, ODroescher, PElger, WAdamski, JHillisch, A Structure-based design, synthesis and in vitro characterization of potent 17beta-hydroxysteroid dehydrogenase type 1 inhibitors based on 2-substitutions of estrone and D-homo-estrone. Bioorg Med Chem Lett19:6740-4 (2009) 
 
17-beta-hydroxysteroid dehydrogenase type 1
Name:17-beta-hydroxysteroid dehydrogenase type 1
Type:Enzyme
Mol. Mass.:34945.13
Organism:Homo sapiens (Human)
Description:P14061
Residue:328
BDBM50311678
NameBDBM50311678
Synonyms:(4bR,10bS,12aS)-9-allyl-8-hydroxy-12a-methyl-2,3,4,4a,5,6,10b,11,12,12a-decahydrochrysen-1(4bH)-one | CHEMBL1080634
TypeSmall organic molecule
Emp. Form.C22H28O2
Mol. Mass.324.4565
SMILESC[C@]12CC[C@H]3[C@@H](CCc4cc(O)c(CC=C)cc34)[C@@H]1CCCC2=O