Reaction Details
TargetEstrogen receptor
LigandBDBM17289
Substrate/Competitorn/a
Meas. Tech.ChEMBL_618687 (CHEMBL1102465)
IC50 96±n/a nM
Citation Möller, GDeluca, DGege, CRosinus, AKowalik, DPeters, ODroescher, PElger, WAdamski, JHillisch, A Structure-based design, synthesis and in vitro characterization of potent 17beta-hydroxysteroid dehydrogenase type 1 inhibitors based on 2-substitutions of estrone and D-homo-estrone. Bioorg Med Chem Lett19:6740-4 (2009) 
 
Estrogen receptor
Name:Estrogen receptor
Type:Protein
Mol. Mass.:66230.44
Organism:Homo sapiens (Human)
Description:P03372
Residue:595
BDBM17289
NameBDBM17289
Synonyms:(1S,10R,11S,15S)-5-hydroxy-15-methyltetracyclo[8.7.0.0^{2,7}.0^{11,15}]heptadeca-2,4,6-trien-14-one Estrone Estrone, 15 Kestrone Unigen [2,4,6,7-3H]-Estrone | folliculin
TypeSteroid
Emp. Form.C18H22O2
Mol. Mass.270.3661
SMILES[H][C@@]12CCC(=O)[C@@]1(C)CC[C@]1([H])c3ccc(O)cc3CC[C@@]21[H]