Reaction Details
TargetProtein kinase C alpha type
LigandBDBM2651
Substrate/Competitorn/a
Meas. Tech.ChEMBL_616121 (CHEMBL1102984)
IC50 760±n/a nM
Citation Gong, LHirschfeld, DTan, YCHeather Hogg, JPeltz, GAvnur, ZDunten, P Discovery of potent and bioavailable GSK-3beta inhibitors. Bioorg Med Chem Lett20:1693-6 (2010) 
 
Protein kinase C alpha type
Name:Protein kinase C alpha type
Type:Enzyme
Mol. Mass.:76755.65
Organism:Homo sapiens (Human)
Description:The recombinant human PKC enzymes were produced using a baculovirus expression system in SF9 cells
Residue:672
BDBM2651
NameBDBM2651
Synonyms:(Phenylindolyl)maleimide deriv. 73 | 3-(2-chlorophenyl)-4-(1-methyl-1H-indol-3-yl)-2,5-dihydro-1H-pyrrole-2,5-dione
TypeSmall organic molecule
Emp. Form.C19H13ClN2O2
Mol. Mass.336.772
SMILESCn1cc(C2=C(C(=O)NC2=O)c2ccccc2Cl)c2ccccc12