Reaction Details
TargetProtein kinase C alpha type
LigandBDBM2645
Substrate/Competitorn/a
Meas. Tech.ChEMBL_616121 (CHEMBL1102984)
IC50 6000±n/a nM
Citation Gong, LHirschfeld, DTan, YCHeather Hogg, JPeltz, GAvnur, ZDunten, P Discovery of potent and bioavailable GSK-3beta inhibitors. Bioorg Med Chem Lett20:1693-6 (2010) 
 
Protein kinase C alpha type
Name:Protein kinase C alpha type
Type:Enzyme
Mol. Mass.:76755.65
Organism:Homo sapiens (Human)
Description:The recombinant human PKC enzymes were produced using a baculovirus expression system in SF9 cells
Residue:672
BDBM2645
NameBDBM2645
Synonyms:(Phenylindolyl)maleimide deriv. 67 | 3-(3-methoxyphenyl)-4-(1-methyl-1H-indol-3-yl)-2,5-dihydro-1H-pyrrole-2,5-dione
TypeSmall organic molecule
Emp. Form.C20H16N2O3
Mol. Mass.332.3526
SMILESCOc1cccc(c1)C1=C(C(=O)NC1=O)c1cn(C)c2ccccc12