Reaction Details
TargetProtein kinase C alpha type
LigandBDBM50313009
Substrate/Competitorn/a
Meas. Tech.ChEMBL_616121 (CHEMBL1102984)
IC50 6600±n/a nM
Citation Gong, LHirschfeld, DTan, YCHeather Hogg, JPeltz, GAvnur, ZDunten, P Discovery of potent and bioavailable GSK-3beta inhibitors. Bioorg Med Chem Lett20:1693-6 (2010) 
 
Protein kinase C alpha type
Name:Protein kinase C alpha type
Type:Enzyme
Mol. Mass.:76755.65
Organism:Homo sapiens (Human)
Description:The recombinant human PKC enzymes were produced using a baculovirus expression system in SF9 cells
Residue:672
BDBM50313009
NameBDBM50313009
Synonyms:3-(3,4-dimethoxyphenyl)-4-(1-methyl-1H-indol-3-yl)-1H-pyrrole-2,5-dione | CHEMBL1087242
TypeSmall organic molecule
Emp. Form.C21H18N2O4
Mol. Mass.362.3786
SMILESCOc1ccc(cc1OC)C1=C(C(=O)NC1=O)c1cn(C)c2ccccc12