Reaction Details
TargetProtein kinase C alpha type
LigandBDBM50312998
Substrate/Competitorn/a
Meas. Tech.ChEMBL_616121 (CHEMBL1102984)
IC50 2200±n/a nM
Citation Gong, LHirschfeld, DTan, YCHeather Hogg, JPeltz, GAvnur, ZDunten, P Discovery of potent and bioavailable GSK-3beta inhibitors. Bioorg Med Chem Lett20:1693-6 (2010) 
 
Protein kinase C alpha type
Name:Protein kinase C alpha type
Type:Enzyme
Mol. Mass.:76755.65
Organism:Homo sapiens (Human)
Description:The recombinant human PKC enzymes were produced using a baculovirus expression system in SF9 cells
Residue:672
BDBM50312998
NameBDBM50312998
Synonyms:(R,S)-3-(3-(2,3-dihydroxypropyl)phenyl)-4-(5-fluoro-1-methyl-1H-indol-3-yl)-1H-pyrrole-2,5-dione | CHEMBL1081973
TypeSmall organic molecule
Emp. Form.C22H19FN2O4
Mol. Mass.394.3957
SMILESCn1cc(C2=C(C(=O)NC2=O)c2cccc(CC(O)CO)c2)c2cc(F)ccc12