Reaction Details
TargetGlycogen synthase kinase-3 beta
LigandBDBM50312996
Substrate/Competitorn/a
Meas. Tech.ChEMBL_616120 (CHEMBL1102983)
IC50 0.400000±n/a nM
Citation Gong, LHirschfeld, DTan, YCHeather Hogg, JPeltz, GAvnur, ZDunten, P Discovery of potent and bioavailable GSK-3beta inhibitors. Bioorg Med Chem Lett20:1693-6 (2010) 
 
Glycogen synthase kinase-3 beta
Name:Glycogen synthase kinase-3 beta
Type:Enzyme
Mol. Mass.:46756.38
Organism:Homo sapiens (Human)
Description:P49841
Residue:420
BDBM50312996
NameBDBM50312996
Synonyms:(R,S)-3-(5-chloro-1-methyl-1H-indol-3-yl)-4-(3-(2,3-dihydroxypropylamino)phenyl)-1H-pyrrole-2,5-dione | CHEMBL1082153
TypeSmall organic molecule
Emp. Form.C22H20ClN3O4
Mol. Mass.425.865
SMILESCn1cc(C2=C(C(=O)NC2=O)c2cccc(NCC(O)CO)c2)c2cc(Cl)ccc12