Reaction Details
TargetGlycogen synthase kinase-3 beta
LigandBDBM50312997
Substrate/Competitorn/a
Meas. Tech.ChEMBL_616120 (CHEMBL1102983)
IC50 1±n/a nM
Citation Gong, LHirschfeld, DTan, YCHeather Hogg, JPeltz, GAvnur, ZDunten, P Discovery of potent and bioavailable GSK-3beta inhibitors. Bioorg Med Chem Lett20:1693-6 (2010) 
 
Glycogen synthase kinase-3 beta
Name:Glycogen synthase kinase-3 beta
Type:Enzyme
Mol. Mass.:46756.38
Organism:Homo sapiens (Human)
Description:P49841
Residue:420
BDBM50312997
NameBDBM50312997
Synonyms:3-(3-(3-hydroxypropylamino)phenyl)-4-(1-methyl-1H-indol-3-yl)-1H-pyrrole-2,5-dione | CHEMBL1082151
TypeSmall organic molecule
Emp. Form.C22H21N3O3
Mol. Mass.375.4204
SMILESCn1cc(C2=C(C(=O)NC2=O)c2cccc(NCCCO)c2)c2ccccc12