Reaction Details
TargetGlycogen synthase kinase-3 beta
LigandBDBM50313006
Substrate/Competitorn/a
Meas. Tech.ChEMBL_616120 (CHEMBL1102983)
IC50 730±n/a nM
Citation Gong, LHirschfeld, DTan, YCHeather Hogg, JPeltz, GAvnur, ZDunten, P Discovery of potent and bioavailable GSK-3beta inhibitors. Bioorg Med Chem Lett20:1693-6 (2010) 
 
Glycogen synthase kinase-3 beta
Name:Glycogen synthase kinase-3 beta
Type:Enzyme
Mol. Mass.:46756.38
Organism:Homo sapiens (Human)
Description:P49841
Residue:420
BDBM50313006
NameBDBM50313006
Synonyms:3-(biphenyl-4-yl)-4-(1-methyl-1H-indol-3-yl)-1H-pyrrole-2,5-dione | CHEMBL1086732
TypeSmall organic molecule
Emp. Form.C25H18N2O2
Mol. Mass.378.4226
SMILESCn1cc(C2=C(C(=O)NC2=O)c2ccc(cc2)-c2ccccc2)c2ccccc12