Reaction Details
TargetGlycogen synthase kinase-3 beta
LigandBDBM50313012
Substrate/Competitorn/a
Meas. Tech.ChEMBL_616120 (CHEMBL1102983)
IC50 10±n/a nM
Citation Gong, LHirschfeld, DTan, YCHeather Hogg, JPeltz, GAvnur, ZDunten, P Discovery of potent and bioavailable GSK-3beta inhibitors. Bioorg Med Chem Lett20:1693-6 (2010) 
 
Glycogen synthase kinase-3 beta
Name:Glycogen synthase kinase-3 beta
Type:Enzyme
Mol. Mass.:46756.38
Organism:Homo sapiens (Human)
Description:P49841
Residue:420
BDBM50313012
NameBDBM50313012
Synonyms:10-(4-(1-methyl-1H-indol-3-yl)-2,5-dioxo-2,5-dihydro-1H-pyrrol-3-yl)-3,4-dihydropyrazino[1,2-a]indole-2(1H)-carbothioamide ROCHE screening, 62
TypeSmall organic molecule
Emp. Form.C25H21N5O2S
Mol. Mass.455.532
SMILESCn1cc(C2=C(C(=O)NC2=O)c2c3CN(CCn3c3ccccc23)C(N)=S)c2ccccc12