Reaction Details
TargetGlycogen synthase kinase-3 beta
LigandBDBM50130725
Substrate/Competitorn/a
Meas. Tech.ChEMBL_616120 (CHEMBL1102983)
IC50 77±n/a nM
Citation Gong, LHirschfeld, DTan, YCHeather Hogg, JPeltz, GAvnur, ZDunten, P Discovery of potent and bioavailable GSK-3beta inhibitors. Bioorg Med Chem Lett20:1693-6 (2010) 
 
Glycogen synthase kinase-3 beta
Name:Glycogen synthase kinase-3 beta
Type:Enzyme
Mol. Mass.:46756.38
Organism:Homo sapiens (Human)
Description:P49841
Residue:420
BDBM50130725
NameBDBM50130725
Synonyms:3-(3-Chloro-4-hydroxy-phenylamino)-4-(2-nitro-phenyl)-pyrrole-2,5-dione CHEMBL322970 SB415286 | cid_4210951
TypeSmall organic molecule
Emp. Form.C16H10ClN3O5
Mol. Mass.359.721
SMILESOc1ccc(NC2=C(C(=O)NC2=O)c2ccccc2[N+]([O-])=O)cc1Cl