Reaction Details
TargetKinesin-like protein KIF11
LigandBDBM50313408
Substrate/Competitorn/a
Meas. Tech.ChEMBL_617338 (CHEMBL1101849)
IC50 95±n/a nM
Citation Schiemann, KFinsinger, DZenke, FAmendt, CKnöchel, TBruge, DBuchstaller, HPEmde, UStähle, WAnzali, S The discovery and optimization of hexahydro-2H-pyrano[3,2-c]quinolines (HHPQs) as potent and selective inhibitors of the mitotic kinesin-5. Bioorg Med Chem Lett20:1491-5 (2010) 
 
Kinesin-like protein KIF11
Name:Kinesin-like protein KIF11
Type:PROTEIN
Mol. Mass.:119138.97
Organism:Homo sapiens (Human)
Description:ChEMBL_1457426
Residue:1056
BDBM50313408
NameBDBM50313408
Synonyms:4-((4aS,5R,10bS)-9-tert-butyl-3,4,4a,5,6,10b-hexahydro-2H-pyrano[3,2-c]quinolin-5-yl)benzene-1,2-diol | CHEMBL1078692
TypeSmall organic molecule
Emp. Form.C22H27NO3
Mol. Mass.353.4547
SMILESCC(C)(C)c1ccc2N[C@H]([C@@H]3CCCO[C@@H]3c2c1)c1ccc(O)c(O)c1