Reaction Details
TargetCarbonic anhydrase 1
LigandBDBM50314531
Substrate/Competitorn/a
Meas. Tech.ChEMBL_625070 (CHEMBL1112519)
Ki 2040±n/a nM
Citation Lopez, MBornaghi, LFInnocenti, AVullo, DCharman, SASupuran, CTPoulsen, SA Sulfonamide linked neoglycoconjugates--a new class of inhibitors for cancer-associated carbonic anhydrases. J Med Chem53:2913-26 (2010) 
 
Carbonic anhydrase 1
Name:Carbonic anhydrase 1
Type:Enzyme
Mol. Mass.:28873.37
Organism:Homo sapiens (Human)
Description:P00915
Residue:261
BDBM50314531
NameBDBM50314531
Synonyms:CHEMBL1092028 | N-4-(Aminosulfonyl)benzyl-S-(2,2',3,3',4',6,6'-hepta-O-acetyl-1-thio-beta-lactosyl)sulfonamide
TypeSmall organic molecule
Emp. Form.C33H44N2O21S2
Mol. Mass.868.833
SMILESCC(=O)OC[C@H]1O[C@H](O[C@@H]2[C@@H](COC(C)=O)O[C@H]([C@H](OC(C)=O)[C@H]2OC(C)=O)S(=O)(=O)NCc2ccc(cc2)S(N)(=O)=O)[C@H](OC(C)=O)[C@@H](OC(C)=O)[C@@H]1OC(C)=O